Target
Capsid scaffolding protein
Ligand
BDBM50075176
Substrate
Meas. Tech.
ChEBML_82452
IC50
2700±n/a nM
Citation
 Pinto, ILJarvest, RLClarke, BDabrowski, CEFenwick, AGorczyca, MMJennings, LJLavery, PSternberg, EJTew, DGWest, A Inhibition of human cytomegalovirus protease by enedione derivatives of thieno[2,3-d]oxazinones through a novel dual acylation/alkylation mechanism. Bioorg Med Chem Lett 9:449-52 (1999)  
Target
Name:
Capsid scaffolding protein
Synonyms:
Human herpesvirus 2 protease UL26
Type:
PROTEIN
Mol. Mass.:
66947.39
Organism:
Human herpesvirus 2 (strain HG52) (HHV-2) (Human herpes simplex virus2)
Description:
ChEMBL_82452
Residue:
637
  
Inhibitor
Name:
BDBM50075176
Synonyms:
(E)-4-Oxo-4-phenyl-but-2-enoic acid [(S)-1-(5-methyl-4-oxo-4H-thieno[2,3-d][1,3]oxazin-2-yl)-ethyl]-amide | CHEMBL141812
Type:
Small organic molecule
Emp. Form.:
C19H16N2O4S
Mol. Mass.:
368.406
SMILES:
C[C@H](NC(=O)\C=C\C(=O)c1ccccc1)c1nc2scc(C)c2c(=O)o1
: