Target
N-formyl peptide receptor 2
Ligand
BDBM50520816
Substrate
Meas. Tech.
ChEMBL_1882211 (CHEMBL4383710)
IC50
22±n/a nM
Citation
 de Gaetano, MButler, EGahan, KZanetti, AMarai, MChen, JCacace, AHams, EMaingot, CMcLoughlin, ABrennan, ELeroy, XLoscher, CEFallon, PPerretti, MGodson, CGuiry, PJ Asymmetric synthesis and biological evaluation of imidazole- and oxazole-containing synthetic lipoxin A Eur J Med Chem 162:80-108 (2019)  
Target
Name:
N-formyl peptide receptor 2
Synonyms:
ALXR, FPRL1, FPR2 FPR2 FPRH1 Formyl Peptide Receptor-Like 1 LXA4 receptor Lipoxin A4 receptor RFP | hFPRL
Type:
G Protein-Coupled Receptor (GPCR)
Mol. Mass.:
38968.35
Organism:
Homo sapiens (Human)
Description:
P25090
Residue:
351
  
Inhibitor
Name:
BDBM50520816
Synonyms:
CHEBI:6498 | LIPOXIN A4
Type:
Small organic molecule
Emp. Form.:
C20H32O5
Mol. Mass.:
352.4651
SMILES:
CCCCC[C@H](O)\C=C\C=C/C=C/C=C/[C@@H](O)[C@@H](O)CCCC(O)=O
: