Target
N-formyl peptide receptor 2
Ligand
BDBM50520819
Substrate
Meas. Tech.
ChEMBL_1882214 (CHEMBL4383713)
IC50
2.6±n/a nM
Citation
 de Gaetano, MButler, EGahan, KZanetti, AMarai, MChen, JCacace, AHams, EMaingot, CMcLoughlin, ABrennan, ELeroy, XLoscher, CEFallon, PPerretti, MGodson, CGuiry, PJ Asymmetric synthesis and biological evaluation of imidazole- and oxazole-containing synthetic lipoxin A Eur J Med Chem 162:80-108 (2019)  
Target
Name:
N-formyl peptide receptor 2
Synonyms:
ALXR, FPRL1, FPR2 FPR2 FPRH1 Formyl Peptide Receptor-Like 1 LXA4 receptor Lipoxin A4 receptor RFP | hFPRL
Type:
G Protein-Coupled Receptor (GPCR)
Mol. Mass.:
38968.35
Organism:
Homo sapiens (Human)
Description:
P25090
Residue:
351
  
Inhibitor
Name:
BDBM50520819
Synonyms:
CHEMBL4440913
Type:
Small organic molecule
Emp. Form.:
C20H34N2O5
Mol. Mass.:
382.4944
SMILES:
CCCCC[C@H](O)c1c(\C=C\[C@@H](O)[C@@H](O)CCCC(=O)OC)nc(C)n1C
: