Target
Potassium voltage-gated channel subfamily H member 2
Ligand
BDBM50117930
Substrate
Meas. Tech.
ChEMBL_1882359 (CHEMBL4383858)
IC50
10.0±n/a nM
Citation
 Farag, AKHassan, AHEJeong, HKwon, YChoi, JGOh, MSPark, KDKim, YKRoh, EJ First-in-class DAPK1/CSF1R dual inhibitors: Discovery of 3,5-dimethoxy-N-(4-(4-methoxyphenoxy)-2-((6-morpholinopyridin-3-yl)amino)pyrimidin-5-yl)benzamide as a potential anti-tauopathies agent. Eur J Med Chem 162:161-175 (2019)  
Target
Name:
Potassium voltage-gated channel subfamily H member 2
Synonyms:
1,3-beta-glucan synthase component GLS2 ERG Eag-related protein 1 Ether-a-go-go-related gene (HERG) Ether-a-go-go-related gene potassium channel 1 Ether-a-go-go-related gene potassium channel 1 (hERG1) Ether-a-go-go-related protein 1 H-ERG KCNH2 Potassium voltage-gated channel subfamily H member 2 (hERG) Voltage-gated potassium channel subunit Kv11.1 hERG Potassium Channel 1 | putative potassium channel subunit
Type:
Multi-pass membrane protein
Mol. Mass.:
126672.65
Organism:
Homo sapiens (Human)
Description:
Q12809
Residue:
1159
  
Inhibitor
Name:
BDBM50117930
Synonyms:
(4-{1-[2-(6-Methyl-pyridin-2-yl)-ethyl]-piperidine-4-carbonyl}-phenyl)-methanesulfonamide CHEMBL327980 E-4031 N-(4-(1-(2-(6-methylpyridin-2-yl)ethyl)piperidine-4-carbonyl)phenyl)methanesulfonamide N-(4-{1-[2-(6-Methyl-pyridin-2-yl)-ethyl]-piperidine-4-carbonyl}-phenyl)-methanesulfonamide (E-4031)
Type:
Small organic molecule
Emp. Form.:
C21H27N3O3S
Mol. Mass.:
401.522
SMILES:
Cc1cccc(CCN2CCC(CC2)C(=O)c2ccc(NS(C)(=O)=O)cc2)n1
: