Target
Retinoic acid receptor alpha
Ligand
BDBM31892
Substrate
Meas. Tech.
ChEBML_195323
Kd
93±n/a nM
Citation
 Vuligonda, VGarst, MEChandraratna, RA Stereoselective synthesis and receptor activity of conformationally defined retinoid X receptor selective ligands. Bioorg Med Chem Lett 9:589-94 (1999)  
Target
Name:
Retinoic acid receptor alpha
Synonyms:
NR1B1 RAR-alpha RARA_HUMAN Retinoic acid receptor alpha/Retinoid X receptor alpha Retinoid receptor
Type:
PROTEIN
Mol. Mass.:
50778.87
Organism:
Homo sapiens (Human)
Description:
ChEMBL_1466191
Residue:
462
  
Inhibitor
Name:
BDBM31892
Synonyms:
9-cis retinoic acid CHEMBL705 alitretinoin
Type:
Small organic molecule
Emp. Form.:
C20H28O2
Mol. Mass.:
300.4351
SMILES:
C\C(\C=C\C1=C(C)CCCC1(C)C)=C\C=C\C(\C)=C\C(O)=O
: