Target
Thromboxane-A synthase
Ligand
BDBM50075644
Substrate
Meas. Tech.
ChEMBL_209930 (CHEMBL813721)
IC50
3±n/a nM
Citation
 Soyka, RGuth, BDWeisenberger, HMLuger, PMüller, TH Guanidine derivatives as combined thromboxane A2 receptor antagonists and synthase inhibitors. J Med Chem 42:1235-49 (1999)  
Target
Name:
Thromboxane-A synthase
Synonyms:
CYP5 Cytochrome P450 5A1 TBXAS1 TXA synthase TXS Thromboxane A2 Synthase (P450 TxA2) Thromboxane prostanoid Thromboxane-A synthase
Type:
Enzyme
Mol. Mass.:
60524.67
Organism:
Homo sapiens (Human)
Description:
P24557
Residue:
533
  
Inhibitor
Name:
BDBM50075644
Synonyms:
(E)-6-[3-({[(E)-Benzenesulfonylimino]-tert-butylamino-methyl}-amino)-phenyl]-6-pyridin-3-yl-hex-5-enoic acid | CHEMBL21954
Type:
Small organic molecule
Emp. Form.:
C28H32N4O4S
Mol. Mass.:
520.643
SMILES:
CC(C)(C)N=C(Nc1cccc(c1)C(=CCCCC(O)=O)c1cccnc1)NS(=O)(=O)c1ccccc1
: