Target
Thromboxane-A synthase
Ligand
BDBM50075630
Substrate
Meas. Tech.
ChEMBL_209930 (CHEMBL813721)
IC50
3±n/a nM
Citation
 Soyka, RGuth, BDWeisenberger, HMLuger, PMüller, TH Guanidine derivatives as combined thromboxane A2 receptor antagonists and synthase inhibitors. J Med Chem 42:1235-49 (1999)  
Target
Name:
Thromboxane-A synthase
Synonyms:
CYP5 Cytochrome P450 5A1 TBXAS1 TXA synthase TXS Thromboxane A2 Synthase (P450 TxA2) Thromboxane prostanoid Thromboxane-A synthase
Type:
Enzyme
Mol. Mass.:
60524.67
Organism:
Homo sapiens (Human)
Description:
P24557
Residue:
533
  
Inhibitor
Name:
BDBM50075630
Synonyms:
6-{3-[1-(1-adamantylamino)-2-cyano-(E)-1-iminomethylamino]phenyl}-6-(3-pyridyl)-(E)-5-hexenoic acid | CHEMBL21852
Type:
Small organic molecule
Emp. Form.:
C29H33N5O2
Mol. Mass.:
483.6046
SMILES:
OC(=O)CCCC=C(c1cccnc1)c1cccc(NC(NC23CC4CC(CC(C4)C2)C3)=NC#N)c1
: