Target
Inositol 1,4,5-trisphosphate receptor type 3
Ligand
BDBM50075649
Substrate
Meas. Tech.
ChEMBL_90244 (CHEMBL697185)
IC50
430±n/a nM
Citation
 Adelt, SPlettenburg, OStricker, RReiser, GAltenbach, HJVogel, G Enzyme-assisted total synthesis of the optical antipodes D-myo-inositol 3,4,5-trisphosphate and D-myo-inositol 1,5, 6-trisphosphate: aspects of their structure-activity relationship to biologically active inositol phosphates. J Med Chem 42:1262-73 (1999)  
Target
Name:
Inositol 1,4,5-trisphosphate receptor type 3
Synonyms:
ITPR3 Inositol 1,4,5-trisphosphate receptor | Inositol 1,4,5-trisphosphate receptor type 3
Type:
PROTEIN
Mol. Mass.:
304100.07
Organism:
Homo sapiens (Human)
Description:
ChEMBL_90252
Residue:
2671
  
Inhibitor
Name:
BDBM50075649
Synonyms:
1D-myo-inositol 1,4,5,6-tetrakis(dihydrogen phosphate) CHEMBL282059
Type:
Small organic molecule
Emp. Form.:
C6H16O18P4
Mol. Mass.:
500.0755
SMILES:
O[C@H]1[C@@H](O)[C@@H](OP(O)(O)=O)[C@H](OP(O)(O)=O)[C@@H](OP(O)(O)=O)[C@@H]1OP(O)(O)=O
: