Target
Glucagon receptor
Ligand
BDBM50075752
Substrate
Meas. Tech.
ChEBML_73000
IC50
150±n/a nM
Citation
 de Laszlo, SEHacker, CLi, BKim, DMacCoss, MMantlo, NPivnichny, JVColwell, LKoch, GECascieri, MAHagmann, WK Potent, orally absorbed glucagon receptor antagonists. Bioorg Med Chem Lett 9:641-6 (1999)  
Target
Name:
Glucagon receptor
Synonyms:
GL-R Gcgr
Type:
PROTEIN
Mol. Mass.:
54941.21
Organism:
Mus musculus
Description:
ChEMBL_1338729
Residue:
485
  
Inhibitor
Name:
BDBM50075752
Synonyms:
4-[5-(4-Chloro-phenyl)-3-(2-isobutoxy-phenyl)-1H-pyrrol-2-yl]-pyridine | CHEMBL347663
Type:
Small organic molecule
Emp. Form.:
C25H23ClN2O
Mol. Mass.:
402.916
SMILES:
CC(C)COc1ccccc1-c1cc([nH]c1-c1ccncc1)-c1ccc(Cl)cc1
: