Target
Glucagon receptor
Ligand
BDBM50075764
Substrate
Meas. Tech.
ChEMBL_72868 (CHEMBL684119)
IC50
190±n/a nM
Citation
 de Laszlo, SEHacker, CLi, BKim, DMacCoss, MMantlo, NPivnichny, JVColwell, LKoch, GECascieri, MAHagmann, WK Potent, orally absorbed glucagon receptor antagonists. Bioorg Med Chem Lett 9:641-6 (1999)  
Target
Name:
Glucagon receptor
Synonyms:
GCGR GLR_HUMAN Glucagon receptor (GlucR)
Type:
Enzyme
Mol. Mass.:
54026.92
Organism:
Homo sapiens (Human)
Description:
P47871
Residue:
477
  
Inhibitor
Name:
BDBM50075764
Synonyms:
4-[3,5-Bis-(4-chloro-phenyl)-1H-pyrrol-2-yl]-pyridine | CHEMBL160490
Type:
Small organic molecule
Emp. Form.:
C21H14Cl2N2
Mol. Mass.:
365.255
SMILES:
Clc1ccc(cc1)-c1cc(c([nH]1)-c1ccncc1)-c1ccc(Cl)cc1
: