Target
Neuropeptide Y receptor type 1
Ligand
BDBM50075798
Substrate
Meas. Tech.
ChEBML_143824
Ki
0.393000±n/a nM
Citation
 Zarrinmayeh, HZimmerman, DMCantrell, BESchober, DABruns, RFGackenheimer, SLOrnstein, PLHipskind, PABritton, TCGehlert, DR Structure-activity relationship of a series of diaminoalkyl substituted benzimidazole as neuropeptide Y Y1 receptor antagonists. Bioorg Med Chem Lett 9:647-52 (1999)  
Target
Name:
Neuropeptide Y receptor type 1
Synonyms:
NPY-Y1 NPY1R NPYR neuropeptide Y receptor Y1
Type:
Enzyme Catalytic Domain
Mol. Mass.:
44399.07
Organism:
Homo sapiens (Human)
Description:
NPY-Y1 NPY1R HUMAN::P25929
Residue:
384
  
Inhibitor
Name:
BDBM50075798
Synonyms:
1-[3-(1-Cyclohexylmethyl-piperidin-4-yl)-propyl]-2-phenoxymethyl-4-(3-piperidin-1-yl-propoxy)-1H-benzoimidazole | CHEMBL348119
Type:
Small organic molecule
Emp. Form.:
C37H54N4O2
Mol. Mass.:
586.8503
SMILES:
C(COc1cccc2n(CCCC3CCN(CC4CCCCC4)CC3)c(COc3ccccc3)nc12)CN1CCCCC1
: