Target
Adenylate cyclase type 8
Ligand
BDBM50521116
Substrate
Meas. Tech.
ChEMBL_1883019 (CHEMBL4384518)
IC50
33000±n/a nM
Citation
 Kaur, JSoto-Velasquez, MDing, ZGhanbarpour, ALill, MAvan Rijn, RMWatts, VJFlaherty, DP Optimization of a 1,3,4-oxadiazole series for inhibition of Ca Eur J Med Chem 162:568-585 (2019)  
Target
Name:
Adenylate cyclase type 8
Synonyms:
4.6.1.1 ADCY8 ATP pyrophosphate-lyase 8 Adenylate cyclase type VIII Ca(2+)/calmodulin-activated adenylyl cyclase
Type:
PROTEIN
Mol. Mass.:
140131.08
Organism:
Homo sapiens (Human)
Description:
ChEMBL_104878
Residue:
1251
  
Inhibitor
Name:
BDBM50521116
Synonyms:
CHEMBL4463572
Type:
Small organic molecule
Emp. Form.:
C16H16F3N3O2
Mol. Mass.:
339.3123
SMILES:
FC(F)(F)c1cccc(c1)C(=O)Nc1nnc(o1)C1CCCCC1
: