Target
Retinoic acid receptor alpha
Ligand
BDBM50075878
Substrate
Meas. Tech.
ChEBML_225937
Kd
14±n/a nM
Citation
 Vuligonda, VStandeven, AMEscobar, MChandraratna, RA A new class of potent RAR antagonists: dihydroanthracenyl, benzochromenyl and benzothiochromenyl retinoids. Bioorg Med Chem Lett 9:743-8 (1999)  
Target
Name:
Retinoic acid receptor alpha
Synonyms:
NR1B1 RAR-alpha RARA_HUMAN Retinoic acid receptor alpha/Retinoid X receptor alpha Retinoid receptor
Type:
PROTEIN
Mol. Mass.:
50778.87
Organism:
Homo sapiens (Human)
Description:
ChEMBL_1466191
Residue:
462
  
Inhibitor
Name:
BDBM50075878
Synonyms:
4-(2,2-Dimethyl-4-p-tolyl-2H-benzo[g]chromen-7-yl)-benzoic acid | CHEMBL162345
Type:
Small organic molecule
Emp. Form.:
C29H24O3
Mol. Mass.:
420.4991
SMILES:
Cc1ccc(cc1)C1=CC(C)(C)Oc2cc3ccc(cc3cc12)-c1ccc(cc1)C(O)=O
: