Target
Complement C1r subcomponent
Ligand
BDBM50063698
Substrate
Meas. Tech.
ChEMBL_48023 (CHEMBL661597)
IC50
12000±n/a nM
Citation
 Plummer, JSCai, CHays, SJGilmore, JLEmmerling, MRMichael, WNarasimhan, LSWatson, MDWang, KNath, REvans, LMJaen, JC Benzenesulfonamide derivatives of 2-substituted 4H-3,1-benzoxazin-4-ones and benzthiazin-4-ones as inhibitors of complement C1r protease. Bioorg Med Chem Lett 9:815-20 (1999)  
Target
Name:
Complement C1r subcomponent
Synonyms:
C1R Complement C1r | Complement C1r subcomponent
Type:
Enzyme
Mol. Mass.:
80113.65
Organism:
Homo sapiens (Human)
Description:
P00736
Residue:
705
  
Inhibitor
Name:
BDBM50063698
Synonyms:
4-Guanidino-benzoic acid 6-carbamimidoyl-naphthalen-2-yl ester CHEMBL273264 | Nafamostat
Type:
Small organic molecule
Emp. Form.:
C19H17N5O2
Mol. Mass.:
347.3706
SMILES:
[#7]\[#6](-[#7])=[#7]/c1ccc(cc1)-[#6](=O)-[#8]-c1ccc2cc(ccc2c1)-[#6](-[#7])=[#7]
: