Target
Prothrombin
Ligand
BDBM50217503
Substrate
Meas. Tech.
ChEMBL_207975 (CHEMBL815802)
IC50
<1±n/a nM
Citation
 Plummer, JSBerryman, KACai, CCody, WLDiMaio, JDoherty, AMEaton, SEdmunds, JJHolland, DRLafleur, DLevesque, SNarasimhan, LSRubin, JRRapundalo, STSiddiqui, MASusser, ASt-Denis, YWinocour, P Potent and selective bicyclic lactam inhibitors of thrombin: Part 3: P1' modifications. Bioorg Med Chem Lett 9:835-40 (1999)  
Target
Name:
Prothrombin
Synonyms:
Activation peptide fragment 1 Coagulation factor II Prothrombin precursor Thrombin heavy chain | Thrombin light chain
Type:
Protein
Mol. Mass.:
70029.57
Organism:
Homo sapiens (Human)
Description:
P00734
Residue:
622
  
Inhibitor
Name:
BDBM50217503
Synonyms:
CHEMBL352928
Type:
Small organic molecule
Emp. Form.:
C30H35N7O4S
Mol. Mass.:
589.708
SMILES:
[H][C@@]12CC[C@H](N1C(=O)CN(C2)C(=O)CCc1ccccc1)C(=O)N[C@@H](CCCNC(N)=N)C(=O)c1nc2ccccc2s1
: