Target
Coagulation factor X
Ligand
BDBM50076072
Substrate
Meas. Tech.
ChEBML_69655
IC50
>2500±n/a nM
Citation
 Reiner, JELim-Wilby, MSBrunck, TKHa-Uong, TGoldman, EAAbelman, MANutt, RFSemple, JETamura, SY Investigation of the S3 site of thrombin: design, synthesis and biological activity of 4-substituted 3-amino-2-pyridones incorporating P1-argininals. Bioorg Med Chem Lett 9:895-900 (1999)  
Target
Name:
Coagulation factor X
Synonyms:
Activated coagulation factor X (FXa) Coagulation factor X precursor F10 Factor X heavy chain Factor Xa Stuart-Prower factor
Type:
Enzyme
Mol. Mass.:
54726.60
Organism:
Homo sapiens (Human)
Description:
Residue:
488
  
Inhibitor
Name:
BDBM50076072
Synonyms:
1N-[1-amino(imino)methyl-6-hydroxy-(5S)-tetrahydro-5-pyridinyl]-2-(3-methylcarboxamido-2-oxo-4-phenethyl-1,2-dihydro-1-pyridinyl)acetamide | CHEMBL171122
Type:
Small organic molecule
Emp. Form.:
C23H30N6O4
Mol. Mass.:
454.5221
SMILES:
CC(=O)Nc1c(CCc2ccccc2)ccn(CC(=O)N[C@H]2CCCN(C2O)C(N)=N)c1=O
: