Target
Tissue-type plasminogen activator
Ligand
BDBM50076221
Substrate
Meas. Tech.
ChEMBL_208234 (CHEMBL815713)
Ki
106±n/a nM
Citation
 Boatman, PDOgbu, COEguchi, MKim, HONakanishi, HCao, BShea, JPKahn, M Secondary structure peptide mimetics: design, synthesis, and evaluation of beta-strand mimetic thrombin inhibitors. J Med Chem 42:1367-75 (1999)  
Target
Name:
Tissue-type plasminogen activator
Synonyms:
Alteplase Reteplase Thrombin receptor protein Tissue-type plasminogen activator (tPA) t-PA t-plasminogen activator
Type:
Enzyme
Mol. Mass.:
62931.08
Organism:
Homo sapiens (Human)
Description:
Residue:
562
  
Inhibitor
Name:
BDBM50076221
Synonyms:
(S)-1-((R)-2-Amino-3-phenyl-propionyl)-pyrrolidine-2-carboxylic acid ((S)-1-chloromethyl-4-guanidino-butyl)-amide | CHEMBL265315
Type:
Small organic molecule
Emp. Form.:
C20H31ClN6O2
Mol. Mass.:
422.952
SMILES:
N[C@H](Cc1ccccc1)C(=O)N1CCC[C@H]1C(=O)N[C@H](CCl)CCCNC(N)=N
: