Target
Integrase
Ligand
BDBM50076270
Substrate
Meas. Tech.
ChEMBL_90575 (CHEMBL701159)
IC50
>333000±n/a nM
Citation
 Lin, ZNeamati, NZhao, HKiryu, YTurpin, JAAberham, CStrebel, KKohn, KWitvrouw, MPannecouque, CDebyser, ZDe Clercq, ERice, WGPommier, YBurke, TR Chicoric acid analogues as HIV-1 integrase inhibitors. J Med Chem 42:1401-14 (1999)  
Target
Name:
Integrase
Synonyms:
Human immunodeficiency virus type 1 integrase
Type:
PROTEIN
Mol. Mass.:
32231.48
Organism:
Human immunodeficiency virus 1
Description:
ChEMBL_90865
Residue:
288
  
Inhibitor
Name:
BDBM50076270
Synonyms:
(E)-3-(3,4-Diacetoxy-phenyl)-acrylic acid (1S,2S)-2-[(E)-3-(3,4-diacetoxy-phenyl)-acryloyloxy]-1-methyl-propyl ester | CHEMBL31435
Type:
Small organic molecule
Emp. Form.:
C30H30O12
Mol. Mass.:
582.552
SMILES:
C[C@H](OC(=O)\C=C\c1ccc(OC(C)=O)c(OC(C)=O)c1)[C@H](C)OC(=O)\C=C\c1ccc(OC(C)=O)c(OC(C)=O)c1
: