Target
Integrase
Ligand
BDBM50076263
Substrate
Meas. Tech.
ChEMBL_90574 (CHEMBL702431)
IC50
33300±n/a nM
Citation
 Lin, ZNeamati, NZhao, HKiryu, YTurpin, JAAberham, CStrebel, KKohn, KWitvrouw, MPannecouque, CDebyser, ZDe Clercq, ERice, WGPommier, YBurke, TR Chicoric acid analogues as HIV-1 integrase inhibitors. J Med Chem 42:1401-14 (1999)  
Target
Name:
Integrase
Synonyms:
Human immunodeficiency virus type 1 integrase
Type:
PROTEIN
Mol. Mass.:
32231.48
Organism:
Human immunodeficiency virus 1
Description:
ChEMBL_90865
Residue:
288
  
Inhibitor
Name:
BDBM50076263
Synonyms:
(2S,3S)-2,3-Bis-[(E)-3-(3,4-diacetoxy-phenyl)-acryloyloxy]-succinic acid | CHEMBL30455
Type:
Small organic molecule
Emp. Form.:
C30H26O16
Mol. Mass.:
642.5178
SMILES:
CC(=O)Oc1ccc(\C=C\C(=O)O[C@@H]([C@H](OC(=O)\C=C\c2ccc(OC(C)=O)c(OC(C)=O)c2)C(O)=O)C(O)=O)cc1OC(C)=O
: