Target
Plasmepsin II
Ligand
BDBM50076286
Substrate
Meas. Tech.
ChEMBL_154909 (CHEMBL764684)
Ki
220±n/a nM
Citation
 Haque, TSSkillman, AGLee, CEHabashita, HGluzman, IYEwing, TJGoldberg, DEKuntz, IDEllman, JA Potent, low-molecular-weight non-peptide inhibitors of malarial aspartyl protease plasmepsin II. J Med Chem 42:1428-40 (1999)  
Target
Name:
Plasmepsin II
Synonyms:
Aspartic hemoglobinase II PLM2_PLAFX Plasmepsin 2 Plasmepsin-II
Type:
Enzyme
Mol. Mass.:
51482.09
Organism:
Plasmodium falciparum
Description:
P46925
Residue:
453
  
Inhibitor
Name:
BDBM50076286
Synonyms:
CHEMBL34051 | N-(2-Benzo[1,3]dioxol-5-yl-ethyl)-N-{(2S,3S)-3-[2-(3-chloro-phenoxy)-acetylamino]-2-hydroxy-4-phenyl-butyl}-3-(dioxo-1,3-dihydro-isoindol-2-yl)-propionamide
Type:
Small organic molecule
Emp. Form.:
C38H36ClN3O8
Mol. Mass.:
698.161
SMILES:
O[C@@H](CN(CCc1ccc2OCOc2c1)C(=O)CCN1C(=O)c2ccccc2C1=O)[C@H](Cc1ccccc1)NC(=O)COc1cccc(Cl)c1
: