Target
Interstitial collagenase
Ligand
BDBM50076351
Substrate
Meas. Tech.
ChEMBL_106319 (CHEMBL714731)
Ki
16000±n/a nM
Citation
 Jacobsen, EJMitchell, MAHendges, SKBelonga, KLSkaletzky, LLStelzer, LSLindberg, TJFritzen, ELSchostarez, HJO'Sullivan, TJMaggiora, LLStuchly, CWLaborde, ALKubicek, MFPoorman, RABeck, JMMiller, HRPetzold, GLScott, PSTruesdell, SEWallace, TLWilks, JWFisher, CGoodman, LVKaytes, PS Synthesis of a series of stromelysin-selective thiadiazole urea matrix metalloproteinase inhibitors. J Med Chem 42:1525-36 (1999)  
Target
Name:
Interstitial collagenase
Synonyms:
CLG MMP1 Matrix metalloproteinase-1 | Matrix metalloproteinase-1 (MMP-1)
Type:
Enzyme
Mol. Mass.:
54010.26
Organism:
Homo sapiens (Human)
Description:
P03956
Residue:
469
  
Inhibitor
Name:
BDBM50076351
Synonyms:
(S)-3-(4-Methoxy-phenyl)-N-methyl-2-[3-(5-thioxo-4,5-dihydro-[1,3,4]thiadiazol-2-yl)-ureido]-propionamide | CHEMBL38571
Type:
Small organic molecule
Emp. Form.:
C14H17N5O3S2
Mol. Mass.:
367.446
SMILES:
CNC(=O)[C@H](Cc1ccc(OC)cc1)NC(=O)Nc1nnc(S)s1
: