Target
Interstitial collagenase
Ligand
BDBM50076374
Substrate
Meas. Tech.
ChEMBL_106319 (CHEMBL714731)
Ki
12000±n/a nM
Citation
 Jacobsen, EJMitchell, MAHendges, SKBelonga, KLSkaletzky, LLStelzer, LSLindberg, TJFritzen, ELSchostarez, HJO'Sullivan, TJMaggiora, LLStuchly, CWLaborde, ALKubicek, MFPoorman, RABeck, JMMiller, HRPetzold, GLScott, PSTruesdell, SEWallace, TLWilks, JWFisher, CGoodman, LVKaytes, PS Synthesis of a series of stromelysin-selective thiadiazole urea matrix metalloproteinase inhibitors. J Med Chem 42:1525-36 (1999)  
Target
Name:
Interstitial collagenase
Synonyms:
CLG MMP1 Matrix metalloproteinase-1 | Matrix metalloproteinase-1 (MMP-1)
Type:
Enzyme
Mol. Mass.:
54010.26
Organism:
Homo sapiens (Human)
Description:
P03956
Residue:
469
  
Inhibitor
Name:
BDBM50076374
Synonyms:
1-((S)-1-Benzyl-2-oxo-2-thiomorpholin-4-yl-ethyl)-3-(5-thioxo-4,5-dihydro-[1,3,4]thiadiazol-2-yl)-urea | CHEMBL288015
Type:
Small organic molecule
Emp. Form.:
C16H19N5O2S3
Mol. Mass.:
409.549
SMILES:
Sc1nnc(NC(=O)N[C@@H](Cc2ccccc2)C(=O)N2CCSCC2)s1
: