Target
Metabotropic glutamate receptor 2
Ligand
BDBM50076395
Substrate
Meas. Tech.
ChEMBL_106208 (CHEMBL713197)
IC50
88000±n/a nM
Citation
 Jullian, NBrabet, IPin, JPAcher, FC Agonist selectivity of mGluR1 and mGluR2 metabotropic receptors: a different environment but similar recognition of an extended glutamate conformation. J Med Chem 42:1546-55 (1999)  
Target
Name:
Metabotropic glutamate receptor 2
Synonyms:
GPRC1B GRM2_HUMAN Metabotropic glutamate receptor mGlu2 | metabotropic glutamate 2
Type:
Enzyme
Mol. Mass.:
95584.88
Organism:
Homo sapiens (Human)
Description:
Q14416
Residue:
872
  
Inhibitor
Name:
BDBM50076395
Synonyms:
(1R,2S,4R)-4-Amino-cyclopentane-1,2,4-tricarboxylic acid | CHEMBL288635
Type:
Small organic molecule
Emp. Form.:
C8H11NO6
Mol. Mass.:
217.176
SMILES:
N[C@@]1(C[C@@H]([C@@H](C1)C(O)=O)C(O)=O)C(O)=O
: