Target
Kelch-like ECH-associated protein 1
Ligand
BDBM304414
Substrate
Meas. Tech.
ChEMBL_1884969 (CHEMBL4386551)
IC50
37±n/a nM
Citation
 Heightman, TDCallahan, JFChiarparin, ECoyle, JEGriffiths-Jones, CLakdawala, ASMcMenamin, RMortenson, PNNorton, DPeakman, TMRich, SJRichardson, CRumsey, WLSanchez, YSaxty, GWillems, HMGWolfe, LWoolford, AJWu, ZYan, HKerns, JKDavies, TG Structure-Activity and Structure-Conformation Relationships of Aryl Propionic Acid Inhibitors of the Kelch-like ECH-Associated Protein 1/Nuclear Factor Erythroid 2-Related Factor 2 (KEAP1/NRF2) Protein-Protein Interaction. J Med Chem 62:4683-4702 (2019)  
Target
Name:
Kelch-like ECH-associated protein 1
Synonyms:
Cytosolic inhibitor of Nrf2 KEAP1 KEAP1_HUMAN KLHL19 | Kelch-like protein 19
Type:
PROTEIN
Mol. Mass.:
69664.53
Organism:
Homo sapiens (Human)
Description:
ChEMBL_107924
Residue:
624
  
Inhibitor
Name:
BDBM304414
Synonyms:
3-(7-methoxy-1-methyl-1H-benzo[d][1,2,3]triazol-5-yl)-3-(4-methyl-3-((5-methyl-1,1-dioxido-4,5-dihydrobenzo[f][1,2,5]thiadiazepin-2(3H)-yl)methyl)phenyl)propanoic acid | US10144731, Example 1
Type:
Small organic molecule
Emp. Form.:
C28H31N5O5S
Mol. Mass.:
549.641
SMILES:
COc1cc(cc2nnn(C)c12)C(CC(O)=O)c1ccc(C)c(CN2CCN(C)c3ccccc3S2(=O)=O)c1
: