Target
Androgen receptor
Ligand
BDBM50076716
Substrate
Meas. Tech.
ChEMBL_36103 (CHEMBL648068)
IC50
33±n/a nM
Citation
 Zhi, LTegley, CMMarschke, KBJones, TK Switching androgen receptor antagonists to agonists by modifying C-ring substituents on piperidino[3,2-g]quinolinone. Bioorg Med Chem Lett 9:1009-12 (1999)  
Target
Name:
Androgen receptor
Synonyms:
ANDR_HUMAN Androgen Receptor Androgen receptor/Baculoviral IAP repeat-containing protein 2 Dihydrotestosterone receptor Nuclear receptor subfamily 3 group C member 4
Type:
Receptor
Mol. Mass.:
99185.27
Organism:
Homo sapiens (Human)
Description:
CHO cells were stably transfected with human AR gene.
Residue:
920
  
Inhibitor
Name:
BDBM50076716
Synonyms:
(7S,8R)-7,8-Dimethyl-4-trifluoromethyl-6,7,8,9-tetrahydro-1H-pyrido[3,2-g]quinolin-2-one | CHEMBL6983
Type:
Small organic molecule
Emp. Form.:
C15H15F3N2O
Mol. Mass.:
296.2876
SMILES:
C[C@H]1Cc2cc3c(cc(=O)[nH]c3cc2N[C@@H]1C)C(F)(F)F
: