Target
Prothrombin
Ligand
BDBM50076722
Substrate
Meas. Tech.
ChEBML_208512
Ki
5±n/a nM
Citation
 Lee, KHwang, SYPark, CW Thrombin inhibitors based on a propargylglycine template. Bioorg Med Chem Lett 9:1013-8 (1999)  
Target
Name:
Prothrombin
Synonyms:
Activation peptide fragment 1 Coagulation factor II Prothrombin precursor Thrombin heavy chain | Thrombin light chain
Type:
Protein
Mol. Mass.:
70029.57
Organism:
Homo sapiens (Human)
Description:
P00734
Residue:
622
  
Inhibitor
Name:
BDBM50076722
Synonyms:
(S)-5-(4-Methylamino-phenyl)-2-(5,6,7,8-tetrahydro-naphthalene-2-sulfonylamino)-pent-4-ynoic acid cyclopentyl-methyl-amide | CHEMBL7587
Type:
Small organic molecule
Emp. Form.:
C28H35N3O3S
Mol. Mass.:
493.661
SMILES:
CNc1ccc(cc1)C#CC[C@H](NS(=O)(=O)c1ccc2CCCCc2c1)C(=O)N(C)C1CCCC1
: