Target
Prothrombin
Ligand
BDBM50076725
Substrate
Meas. Tech.
ChEBML_208512
Ki
27±n/a nM
Citation
 Lee, KHwang, SYPark, CW Thrombin inhibitors based on a propargylglycine template. Bioorg Med Chem Lett 9:1013-8 (1999)  
Target
Name:
Prothrombin
Synonyms:
Activation peptide fragment 1 Coagulation factor II Prothrombin precursor Thrombin heavy chain | Thrombin light chain
Type:
Protein
Mol. Mass.:
70029.57
Organism:
Homo sapiens (Human)
Description:
P00734
Residue:
622
  
Inhibitor
Name:
BDBM50076725
Synonyms:
(S)-2-(6-Methoxy-naphthalene-2-sulfonylamino)-5-(4-methylamino-phenyl)-pent-4-ynoic acid cyclopentyl-methyl-amide | CHEMBL7758
Type:
Small organic molecule
Emp. Form.:
C29H33N3O4S
Mol. Mass.:
519.655
SMILES:
CNc1ccc(cc1)C#CC[C@H](NS(=O)(=O)c1ccc2cc(OC)ccc2c1)C(=O)N(C)C1CCCC1
: