Target
Prothrombin
Ligand
BDBM50077049
Substrate
Meas. Tech.
ChEBML_208529
Ki
38±n/a nM
Citation
 Ambler, JBrown, LCockcroft, XLGrütter, MHayler, JJanus, DJones, DKane, PMenear, KPriestle, JSmith, GTalbot, MWalker, CVWathey, B Optimisation of the P2 pharmacophore in a series of thrombin inhibitors: ion-dipole interactions with lysine 60G. Bioorg Med Chem Lett 9:1317-22 (1999)  
Target
Name:
Prothrombin
Synonyms:
Activation peptide fragment 1 Coagulation factor II Prothrombin precursor Thrombin heavy chain | Thrombin light chain
Type:
Protein
Mol. Mass.:
70029.57
Organism:
Homo sapiens (Human)
Description:
P00734
Residue:
622
  
Inhibitor
Name:
BDBM50077049
Synonyms:
CHEMBL24186 | Methyl-carbamic acid 2-{1-[(S)-3-benzothiazol-2-yl-2-(3,3-dimethyl-1,2,3,4-tetrahydro-quinoline-8-sulfonylamino)-propionyl]-piperidin-4-yl}-ethyl ester
Type:
Small organic molecule
Emp. Form.:
C30H39N5O5S2
Mol. Mass.:
613.791
SMILES:
CNC(=O)OCCC1CCN(CC1)C(=O)[C@H](Cc1nc2ccccc2s1)NS(=O)(=O)c1cccc2CC(C)(C)CNc12
: