Target
Prothrombin
Ligand
BDBM50077054
Substrate
Meas. Tech.
ChEBML_208529
Ki
1000±n/a nM
Citation
 Ambler, JBrown, LCockcroft, XLGrütter, MHayler, JJanus, DJones, DKane, PMenear, KPriestle, JSmith, GTalbot, MWalker, CVWathey, B Optimisation of the P2 pharmacophore in a series of thrombin inhibitors: ion-dipole interactions with lysine 60G. Bioorg Med Chem Lett 9:1317-22 (1999)  
Target
Name:
Prothrombin
Synonyms:
Activation peptide fragment 1 Coagulation factor II Prothrombin precursor Thrombin heavy chain | Thrombin light chain
Type:
Protein
Mol. Mass.:
70029.57
Organism:
Homo sapiens (Human)
Description:
P00734
Residue:
622
  
Inhibitor
Name:
BDBM50077054
Synonyms:
3,3-Dimethyl-1,2,3,4-tetrahydro-quinoline-8-sulfonic acid ((S)-1-benzothiazol-2-ylmethyl-2-{4-[2-(3,3-dimethyl-ureido)-ethyl]-piperidin-1-yl}-2-oxo-ethyl)-amide | CHEMBL282065
Type:
Small organic molecule
Emp. Form.:
C31H42N6O4S2
Mol. Mass.:
626.833
SMILES:
CN(C)C(=O)NCCC1CCN(CC1)C(=O)[C@H](Cc1nc2ccccc2s1)NS(=O)(=O)c1cccc2CC(C)(C)CNc12
: