Target
C5a anaphylatoxin chemotactic receptor 1
Ligand
BDBM50077507
Substrate
Meas. Tech.
ChEMBL_41606 (CHEMBL650559)
IC50
17000±n/a nM
Citation
 Finch, AMWong, AKPaczkowski, NJWadi, SKCraik, DJFairlie, DPTaylor, SM Low-molecular-weight peptidic and cyclic antagonists of the receptor for the complement factor C5a. J Med Chem 42:1965-74 (1999)  
Target
Name:
C5a anaphylatoxin chemotactic receptor 1
Synonyms:
C5AR C5AR1_HUMAN C5a anaphylatoxin chemotactic receptor C5a-R | CD_antigen=CD88
Type:
Enzyme
Mol. Mass.:
39347.68
Organism:
Homo sapiens (Human)
Description:
P21730
Residue:
350
  
Inhibitor
Name:
BDBM50077507
Synonyms:
(S)-2-Acetylamino-N-[(5S,10R,13S,16R,18aS)-16-cyclohexylmethyl-10-(2-guanidino-ethyl)-13-(1H-indol-3-ylmethyl)-4,9,12,15,18-pentaoxo-octadecahydro-3a,8,11,14,17-pentaaza-cyclopentacycloheptadecen-5-yl]-3-phenyl-propionamide | CHEMBL58841
Type:
Small organic molecule
Emp. Form.:
C45H61N11O7
Mol. Mass.:
868.0353
SMILES:
CC(=O)N[C@@H](Cc1ccccc1)C(=O)N[C@H]1CCNC(=O)[C@@H](CCNC(N)=N)NC(=O)[C@H](Cc2c[nH]c3ccccc23)NC(=O)[C@@H](CC2CCCCC2)NC(=O)[C@@H]2CCCN2C1=O
: