Target
C5a anaphylatoxin chemotactic receptor 1
Ligand
BDBM50077480
Substrate
Meas. Tech.
ChEMBL_41605 (CHEMBL650558)
IC50
3235.94±n/a nM
Citation
 Finch, AMWong, AKPaczkowski, NJWadi, SKCraik, DJFairlie, DPTaylor, SM Low-molecular-weight peptidic and cyclic antagonists of the receptor for the complement factor C5a. J Med Chem 42:1965-74 (1999)  
Target
Name:
C5a anaphylatoxin chemotactic receptor 1
Synonyms:
C5AR C5AR1_HUMAN C5a anaphylatoxin chemotactic receptor C5a-R | CD_antigen=CD88
Type:
Enzyme
Mol. Mass.:
39347.68
Organism:
Homo sapiens (Human)
Description:
P21730
Residue:
350
  
Inhibitor
Name:
BDBM50077480
Synonyms:
(S)-2-Acetylamino-N-[(5S,12R,15S,18R,20aS)-18-cyclohexylmethyl-12-(2-guanidino-ethyl)-15-(1H-indol-3-ylmethyl)-4,11,14,17,20-pentaoxo-icosahydro-3a,10,13,16,19-pentaaza-cyclopentacyclononadecen-5-yl]-3-phenyl-propionamide | CHEMBL291589
Type:
Small organic molecule
Emp. Form.:
C47H65N11O7
Mol. Mass.:
896.0885
SMILES:
CC(=O)N[C@@H](Cc1ccccc1)C(=O)N[C@H]1CCCCNC(=O)[C@@H](CCNC(N)=N)NC(=O)[C@H](Cc2c[nH]c3ccccc23)NC(=O)[C@@H](CC2CCCCC2)NC(=O)[C@@H]2CCCN2C1=O
: