Target
Cannabinoid receptor 1
Ligand
BDBM50077515
Substrate
Meas. Tech.
ChEMBL_46816 (CHEMBL657060)
Ki
4260.0±n/a nM
Citation
 Ng, EWAung, MMAbood, MEMartin, BRRazdan, RK Unique analogues of anandamide: arachidonyl ethers and carbamates and norarachidonyl carbamates and ureas. J Med Chem 42:1975-81 (1999)  
Target
Name:
Cannabinoid receptor 1
Synonyms:
Brain-type cannabinoid receptor CB-R CNR1_RAT Cannabinoid receptor Cnr1 | Skr6
Type:
G Protein-Coupled Receptor (GPCR)
Mol. Mass.:
52856.55
Organism:
Rattus norvegicus (rat)
Description:
P20272
Residue:
473
  
Inhibitor
Name:
BDBM50077515
Synonyms:
(5Z,8Z,11Z,14Z)-1-Methoxy-icosa-5,8,11,14-tetraene | CHEMBL58019
Type:
Small organic molecule
Emp. Form.:
C21H36O
Mol. Mass.:
304.5099
SMILES:
CCCCC\C=C/C\C=C/C\C=C/C\C=C/CCCCOC
: