Target
Cannabinoid receptor 1
Ligand
BDBM50077510
Substrate
Meas. Tech.
ChEMBL_46816 (CHEMBL657060)
Ki
91±n/a nM
Citation
 Ng, EWAung, MMAbood, MEMartin, BRRazdan, RK Unique analogues of anandamide: arachidonyl ethers and carbamates and norarachidonyl carbamates and ureas. J Med Chem 42:1975-81 (1999)  
Target
Name:
Cannabinoid receptor 1
Synonyms:
Brain-type cannabinoid receptor CB-R CNR1_RAT Cannabinoid receptor Cnr1 | Skr6
Type:
G Protein-Coupled Receptor (GPCR)
Mol. Mass.:
52856.55
Organism:
Rattus norvegicus (rat)
Description:
P20272
Residue:
473
  
Inhibitor
Name:
BDBM50077510
Synonyms:
1-((4Z,7Z,10Z,13Z)-Nonadeca-4,7,10,13-tetraenyl)-3-propyl-urea | CHEMBL58281
Type:
Small organic molecule
Emp. Form.:
C23H40N2O
Mol. Mass.:
360.5765
SMILES:
CCCCC\C=C/C\C=C/C\C=C/C\C=C/CCCNC(=O)NCCC
: