Target
Cannabinoid receptor 1
Ligand
BDBM50077520
Substrate
Meas. Tech.
ChEMBL_46816 (CHEMBL657060)
Ki
871±n/a nM
Citation
 Ng, EWAung, MMAbood, MEMartin, BRRazdan, RK Unique analogues of anandamide: arachidonyl ethers and carbamates and norarachidonyl carbamates and ureas. J Med Chem 42:1975-81 (1999)  
Target
Name:
Cannabinoid receptor 1
Synonyms:
Brain-type cannabinoid receptor CB-R CNR1_RAT Cannabinoid receptor Cnr1 | Skr6
Type:
G Protein-Coupled Receptor (GPCR)
Mol. Mass.:
52856.55
Organism:
Rattus norvegicus (rat)
Description:
P20272
Residue:
473
  
Inhibitor
Name:
BDBM50077520
Synonyms:
(5Z,8Z,11Z,14Z)-1-Isopropoxy-icosa-5,8,11,14-tetraene | CHEMBL59064
Type:
Small organic molecule
Emp. Form.:
C23H40O
Mol. Mass.:
332.5631
SMILES:
CCCCC\C=C/C\C=C/C\C=C/C\C=C/CCCCOC(C)C
: