Target
Pepsin A
Ligand
BDBM50077620
Substrate
Meas. Tech.
ChEMBL_154143 (CHEMBL759813)
IC50
690±n/a nM
Citation
 Kratzel, MSchlichtner, BKirchmayer, RBernkop-Schnürch, A Simplified pepstatins: synthesis and evaluation of N-terminally modified analogues. J Med Chem 42:2041-5 (1999)  
Target
Name:
Pepsin A
Synonyms:
PEPA_PIG Pepsin | Pepsin A precursor
Type:
Enzyme
Mol. Mass.:
41232.87
Organism:
Porcine
Description:
Residue:
385
  
Inhibitor
Name:
BDBM50077620
Synonyms:
CHEMBL62319 | {(S)-1-[(S)-1-((S)-2-Hydroxy-1-isobutyl-octylcarbamoyl)-2-methyl-propylcarbamoyl]-2-methyl-propyl}-carbamic acid benzyl ester
Type:
Small organic molecule
Emp. Form.:
C30H51N3O5
Mol. Mass.:
533.743
SMILES:
CCCCCCC(O)[C@H](CC(C)C)NC(=O)[C@@H](NC(=O)[C@@H](NC(=O)OCc1ccccc1)C(C)C)C(C)C
: