Target
Pepsin A
Ligand
BDBM50077623
Substrate
Meas. Tech.
ChEMBL_154143 (CHEMBL759813)
IC50
210±n/a nM
Citation
 Kratzel, MSchlichtner, BKirchmayer, RBernkop-Schnürch, A Simplified pepstatins: synthesis and evaluation of N-terminally modified analogues. J Med Chem 42:2041-5 (1999)  
Target
Name:
Pepsin A
Synonyms:
PEPA_PIG Pepsin | Pepsin A precursor
Type:
Enzyme
Mol. Mass.:
41232.87
Organism:
Porcine
Description:
Residue:
385
  
Inhibitor
Name:
BDBM50077623
Synonyms:
CHEMBL63831 | {(S)-1-[(S)-1-((S)-2-Hydroxy-1-isobutyl-octylcarbamoyl)-2-methyl-propylcarbamoyl]-2-methyl-propyl}-carbamic acid tert-butyl ester
Type:
Small organic molecule
Emp. Form.:
C27H53N3O5
Mol. Mass.:
499.7268
SMILES:
CCCCCCC(O)[C@H](CC(C)C)NC(=O)[C@@H](NC(=O)[C@@H](NC(=O)OC(C)(C)C)C(C)C)C(C)C
: