Target
Gamma-aminobutyric acid type B receptor subunit 1/2
Ligand
BDBM50077628
Substrate
Meas. Tech.
ChEMBL_68567 (CHEMBL679654)
IC50
>140±n/a nM
Citation
 Karla, REbert, BThorkildsen, CHerdeis, CJohansen, TNNielsen, BKrogsgaard-Larsen, P Synthesis and pharmacology of the baclofen homologues 5-amino-4-(4-chlorophenyl)pentanoic acid and the R- and S-enantiomers of 5-amino-3-(4-chlorophenyl)pentanoic acid. J Med Chem 42:2053-9 (1999)  
Target
Name:
Gamma-aminobutyric acid type B receptor subunit 1/2
Synonyms:
GABA B receptor | GABA-B receptor 1/2
Type:
Mol. Mass.:
Description:
ASSAY_ID of EBI is 68556
Components:
This complex has 2 components.
Component 1
Name:
Gamma-aminobutyric acid type B receptor subunit 1
Synonyms:
GABA B GABA uptake GABA-B-R1 GABABR1 Gabbr1 | Gb1
Type:
Enzyme Catalytic Domain
Mol. Mass.:
111548.69
Organism:
Rattus norvegicus (Rat)
Description:
Q9Z0U4
Residue:
991
  
Component 2
Name:
Gamma-aminobutyric acid type B receptor subunit 2
Synonyms:
GABA B receptor Gabbr2 | Gpr51
Type:
PROTEIN
Mol. Mass.:
105775.46
Organism:
Rattus norvegicus
Description:
O88871
Residue:
940
  
Inhibitor
Name:
BDBM50077628
Synonyms:
(S)-5-Amino-3-(4-chloro-phenyl)-pentanoic acid | CHEMBL65297
Type:
Small organic molecule
Emp. Form.:
C11H14ClNO2
Mol. Mass.:
227.687
SMILES:
NCC[C@@H](CC(O)=O)c1ccc(Cl)cc1
: