Target
Proteinase-activated receptor 1
Ligand
BDBM50077733
Substrate
Meas. Tech.
ChEMBL_151863 (CHEMBL765376)
IC50
2300±n/a nM
Citation
 McComsey, DFHawkins, MJAndrade-Gordon, PAddo, MFOksenberg, DMaryanoff, BE Heterocycle-peptide hybrid compounds. Aminotriazole-containing agonists of the thrombin receptor (PAR-1). Bioorg Med Chem Lett 9:1423-8 (1999)  
Target
Name:
Proteinase-activated receptor 1
Synonyms:
CF2R F2R PAR1 Proteinase activated receptor 1 TR Thrombin receptor/ Proteinase-activated receptor 1(Par-1)
Type:
Protein
Mol. Mass.:
47450.07
Organism:
Homo sapiens (Human)
Description:
P25116
Residue:
425
  
Inhibitor
Name:
BDBM50077733
Synonyms:
Benzo[b]thiophene-2-carboxylic acid {(S)-1-[(S)-1-((S)-1-carbamoyl-2-phenyl-ethylcarbamoyl)-4-guanidino-butylcarbamoyl]-2-cyclohexyl-ethyl}-amide | CHEMBL32941
Type:
Small organic molecule
Emp. Form.:
C33H43N7O4S
Mol. Mass.:
633.804
SMILES:
NC(=N)NCCC[C@H](NC(=O)[C@H](CC1CCCCC1)NC(=O)c1cc2ccccc2s1)C(=O)N[C@@H](Cc1ccccc1)C(N)=O
: