Target
Matrix metalloproteinase-9
Ligand
BDBM50077790
Substrate
Meas. Tech.
ChEBML_105543
Ki
2±n/a nM
Citation
 Duan, JJChen, LXue, CBWasserman, ZRHardman, KDCovington, MBCopeland, RRArner, ECDecicco, CP P1, P2'-linked macrocyclic amine derivatives as matrix metalloproteinase inhibitors. Bioorg Med Chem Lett 9:1453-8 (1999)  
Target
Name:
Matrix metalloproteinase-9
Synonyms:
67 kDa matrix metalloproteinase-9 92 kDa gelatinase CLG4B Gelatinase B MMP9 Matrix metalloproteinase 9 (MMP-9) Matrix metalloproteinase-9 (MMP9)
Type:
Enzyme
Mol. Mass.:
78452.28
Organism:
Homo sapiens (Human)
Description:
P14780
Residue:
707
  
Inhibitor
Name:
BDBM50077790
Synonyms:
(2S,3R,6S)-10-Benzenesulfonyl-4-oxo-3-(3-phenyl-propyl)-1-oxa-5,10-diaza-cyclotetradecane-2,6-dicarboxylic acid 2-hydroxyamide 6-methylamide | CHEMBL32310
Type:
Small organic molecule
Emp. Form.:
C29H40N4O7S
Mol. Mass.:
588.716
SMILES:
CNC(=O)[C@@H]1CCCN(CCCCO[C@@H]([C@@H](CCCc2ccccc2)C(=O)N1)C(=O)NO)S(=O)(=O)c1ccccc1
: