Target
5-hydroxytryptamine receptor 1B
Ligand
BDBM50065420
Substrate
Meas. Tech.
ChEMBL_1600 (CHEMBL616626)
EC50
810±n/a nM
Citation
 van Niel, MBCollins, IBeer, MSBroughton, HBCheng, SKGoodacre, SCHeald, ALocker, KLMacLeod, AMMorrison, DMoyes, CRO'Connor, DPike, ARowley, MRussell, MGSohal, BStanton, JAThomas, SVerrier, HWatt, APCastro, JL Fluorination of 3-(3-(piperidin-1-yl)propyl)indoles and 3-(3-(piperazin-1-yl)propyl)indoles gives selective human 5-HT1D receptor ligands with improved pharmacokinetic profiles. J Med Chem 42:2087-104 (1999)  
Target
Name:
5-hydroxytryptamine receptor 1B
Synonyms:
5-HT-1B 5-HT1B 5HT1B_HUMAN HTR1DB Serotonin (5-HT) receptor Serotonin Receptor 1B
Type:
G Protein-Coupled Receptor (GPCR)
Mol. Mass.:
43579.17
Organism:
Homo sapiens (Human)
Description:
Receptor binding assays were performed using human clone stably expressed in CHO cells
Residue:
390
  
Inhibitor
Name:
BDBM50065420
Synonyms:
3-(2-Fluoro-3-{4-[2-(3-fluoro-phenyl)-ethyl]-piperazin-1-yl}-propyl)-5-[1,2,4]triazol-4-yl-1H-indole | CHEMBL63432
Type:
Small organic molecule
Emp. Form.:
C25H28F2N6
Mol. Mass.:
450.5268
SMILES:
FC(CN1CCN(CCc2cccc(F)c2)CC1)Cc1c[nH]c2ccc(cc12)-n1cnnc1
: