Target
RAF proto-oncogene serine/threonine-protein kinase
Ligand
BDBM50077973
Substrate
Meas. Tech.
ChEMBL_163344 (CHEMBL765226)
IC50
>10000±n/a nM
Citation
 Liverton, NJButcher, JWClaiborne, CFClaremon, DALibby, BENguyen, KTPitzenberger, SMSelnick, HGSmith, GRTebben, AVacca, JPVarga, SLAgarwal, LDancheck, KForsyth, AJFletcher, DSFrantz, BHanlon, WAHarper, CFHofsess, SJKostura, MLin, JLuell, SO'Neill, EAO'Keefe, SJ Design and synthesis of potent, selective, and orally bioavailable tetrasubstituted imidazole inhibitors of p38 mitogen-activated protein kinase. J Med Chem 42:2180-90 (1999)  
Target
Name:
RAF proto-oncogene serine/threonine-protein kinase
Synonyms:
C-Raf Protein Kinase RAF RAF1 Raf-1 Serine/threonine-protein kinase C-Raf | cRaf
Type:
Serine/threonine-protein kinase
Mol. Mass.:
73082.52
Organism:
Homo sapiens (Human)
Description:
P04049
Residue:
648
  
Inhibitor
Name:
BDBM50077973
Synonyms:
4-[5-(4-Isopropyl-phenyl)-2-phenyl-3H-imidazol-4-yl]-pyridine | CHEMBL71922
Type:
Small organic molecule
Emp. Form.:
C23H21N3
Mol. Mass.:
339.4329
SMILES:
CC(C)c1ccc(cc1)-c1[nH]c(nc1-c1ccncc1)-c1ccccc1
: