Target
Mitogen-activated protein kinase 9
Ligand
BDBM50077977
Substrate
Meas. Tech.
ChEMBL_216693 (CHEMBL820306)
IC50
175±n/a nM
Citation
 Liverton, NJButcher, JWClaiborne, CFClaremon, DALibby, BENguyen, KTPitzenberger, SMSelnick, HGSmith, GRTebben, AVacca, JPVarga, SLAgarwal, LDancheck, KForsyth, AJFletcher, DSFrantz, BHanlon, WAHarper, CFHofsess, SJKostura, MLin, JLuell, SO'Neill, EAO'Keefe, SJ Design and synthesis of potent, selective, and orally bioavailable tetrasubstituted imidazole inhibitors of p38 mitogen-activated protein kinase. J Med Chem 42:2180-90 (1999)  
Target
Name:
Mitogen-activated protein kinase 9
Synonyms:
JNK-55 JNK2/JNK3 MK09_HUMAN Mitogen-activated protein kinase 8/9 SAPK1A c-Jun N-terminal kinase 2 | c-Jun N-terminal kinase 2 (JNK2)
Type:
Enzyme
Mol. Mass.:
48131.49
Organism:
Homo sapiens (Human)
Description:
JNK-2 was purchased from Upstate Cell Signaling Solutions (formerly Upstate Biotechnology).
Residue:
424
  
Inhibitor
Name:
BDBM50077977
Synonyms:
4-(2,4-diphenyl-1H-imidazol-5-yl)-N-methylpyrimidin-2-amine [4-(2,5-Diphenyl-3H-imidazol-4-yl)-pyrimidin-2-yl]-methyl-amine
Type:
Small organic molecule
Emp. Form.:
C20H17N5
Mol. Mass.:
327.3825
SMILES:
CNc1nccc(n1)-c1nc([nH]c1-c1ccccc1)-c1ccccc1
: