Target
Scytalone dehydratase
Ligand
BDBM50078286
Substrate
Meas. Tech.
ChEBML_199522
Ki
0.730000±n/a nM
Citation
 Jordan, DBLessen, TAWawrzak, ZBisaha, JJGehret, TCHansen, SLSchwartz, RSBasarab, GS Design of scytalone dehydratase inhibitors as rice blast fungicides: (N-phenoxypropyl)-carboxamides. Bioorg Med Chem Lett 9:1607-12 (1999)  
Target
Name:
Scytalone dehydratase
Synonyms:
SCYD_MAGO7 Scytalone dehydratase
Type:
PROTEIN
Mol. Mass.:
20248.63
Organism:
Magnaporthe grisea
Description:
ChEMBL_199536
Residue:
172
  
Inhibitor
Name:
BDBM50078286
Synonyms:
(S)-2-Cyano-N-[(R)-2-(2,5-difluoro-phenoxy)-1-methyl-ethyl]-3,3-dimethyl-butyramide | CHEMBL38816
Type:
Small organic molecule
Emp. Form.:
C16H20F2N2O2
Mol. Mass.:
310.339
SMILES:
C[C@H](COc1cc(F)ccc1F)NC(=O)[C@H](C#N)C(C)(C)C
: