Target
Acetylcholinesterase
Ligand
BDBM50523387
Substrate
Meas. Tech.
ChEMBL_1890180 (CHEMBL4391934)
Kd
4820±n/a nM
Citation
 Chalupova, KKorabecny, JBartolini, MMonti, BLamba, DCaliandro, RPesaresi, ABrazzolotto, XGastellier, AJNachon, FPejchal, JJarosova, MHepnarova, VJun, DHrabinova, MDolezal, RZdarova Karasova, JMzik, MKristofikova, ZMisik, JMuckova, LJost, PSoukup, OBenkova, MSetnicka, VHabartova, LChvojkova, MKleteckova, LVales, KMezeiova, EUliassi, EValis, MNepovimova, EBolognesi, MLKuca, K Novel tacrine-tryptophan hybrids: Multi-target directed ligands as potential treatment for Alzheimer's disease. Eur J Med Chem 168:491-514 (2019)  
Target
Name:
Acetylcholinesterase
Synonyms:
ACES_ELEEL Acetylcholinesterase (EeAChE) | ache
Type:
Enzyme
Mol. Mass.:
71812.79
Organism:
Electrophorus electricus (Electric eel)
Description:
Residue:
633
  
Inhibitor
Name:
BDBM50523387
Synonyms:
CHEMBL4556281
Type:
Small organic molecule
Emp. Form.:
C30H38Cl3N5O
Mol. Mass.:
591.015
SMILES:
Cl.Cl.N[C@@H](Cc1c[nH]c2ccccc12)C(=O)NCCCCCCNc1c2CCCCc2nc2cc(Cl)ccc12
: