Target
Neuraminidase
Ligand
BDBM50078328
Substrate
Meas. Tech.
ChEMBL_144721 (CHEMBL750942)
IC50
10000±n/a nM
Citation
 Atigadda, VRBrouillette, WJDuarte, FAli, SMBabu, YSBantia, SChand, PChu, NMontgomery, JAWalsh, DASudbeck, EAFinley, JLuo, MAir, GMLaver, GW Potent inhibition of influenza sialidase by a benzoic acid containing a 2-pyrrolidinone substituent. J Med Chem 42:2332-43 (1999)  
Target
Name:
Neuraminidase
Synonyms:
Influenza B Virus Neuraminidase NRAM_INBLE Neuraminidase B
Type:
Enzyme
Mol. Mass.:
51446.67
Organism:
Influenza B virus (B/Lee/40)
Description:
Residue:
466
  
Inhibitor
Name:
BDBM50078328
Synonyms:
(4R,5S,6S)-5-Acetylamino-4-hydroxy-6-((1R,2R)-1,2,3-trihydroxy-propyl)-5,6-dihydro-4H-pyran-2-carboxylic acid | CHEMBL77627
Type:
Small organic molecule
Emp. Form.:
C11H17NO8
Mol. Mass.:
291.2546
SMILES:
CC(=O)N[C@H]1[C@H](O)C=C(O[C@@H]1[C@H](O)[C@H](O)CO)C(O)=O
: