Target
Neuraminidase
Ligand
BDBM5279
Substrate
Meas. Tech.
ChEMBL_144721 (CHEMBL750942)
IC50
10000±n/a nM
Citation
 Atigadda, VRBrouillette, WJDuarte, FAli, SMBabu, YSBantia, SChand, PChu, NMontgomery, JAWalsh, DASudbeck, EAFinley, JLuo, MAir, GMLaver, GW Potent inhibition of influenza sialidase by a benzoic acid containing a 2-pyrrolidinone substituent. J Med Chem 42:2332-43 (1999)  
Target
Name:
Neuraminidase
Synonyms:
Influenza B Virus Neuraminidase NRAM_INBLE Neuraminidase B
Type:
Enzyme
Mol. Mass.:
51446.67
Organism:
Influenza B virus (B/Lee/40)
Description:
Residue:
466
  
Inhibitor
Name:
BDBM5279
Synonyms:
3-carbamimidamido-4-[2-(hydroxymethyl)-5-oxopyrrolidin-1-yl]benzoic acid CHEMBL57426
Type:
Small organic molecule
Emp. Form.:
C13H16N4O4
Mol. Mass.:
292.2905
SMILES:
NC(=N)Nc1cc(ccc1N1C(CO)CCC1=O)C(O)=O
: