Target
Uracil-DNA glycosylase
Ligand
BDBM50078344
Substrate
Meas. Tech.
ChEMBL_212800 (CHEMBL816908)
IC50
150000±n/a nM
Citation
 Sun, HZhi, CWright, GEUbiali, DPregnolato, MVerri, AFocher, FSpadari, S Molecular modeling and synthesis of inhibitors of herpes simplex virus type 1 uracil-DNA glycosylase. J Med Chem 42:2344-50 (1999)  
Target
Name:
Uracil-DNA glycosylase
Synonyms:
DGU UNG UNG15 Uracil-DNA glycosylase (UNG)
Type:
Protein
Mol. Mass.:
34661.15
Organism:
Homo sapiens (Human)
Description:
P1305
Residue:
313
  
Inhibitor
Name:
BDBM50078344
Synonyms:
6-(4-Octyl-phenoxy)-1H-pyrimidine-2,4-dione | CHEMBL79489
Type:
Small organic molecule
Emp. Form.:
C18H24N2O3
Mol. Mass.:
316.3948
SMILES:
CCCCCCCCc1ccc(Oc2cc(=O)[nH]c(=O)[nH]2)cc1
: