Target
Xaa-Pro aminopeptidase 2
Ligand
BDBM50078395
Substrate
Meas. Tech.
ChEMBL_35521 (CHEMBL644754)
IC50
>5000000±n/a nM
Citation
 Maggiora, LLOrawski, ATSimmons, WH Apstatin analogue inhibitors of aminopeptidase P, a bradykinin-degrading enzyme. J Med Chem 42:2394-402 (1999)  
Target
Name:
Xaa-Pro aminopeptidase 2
Synonyms:
XPP2_RAT | Xpnpep2
Type:
PROTEIN
Mol. Mass.:
76070.70
Organism:
Rattus norvegicus
Description:
ChEMBL_35521
Residue:
674
  
Inhibitor
Name:
BDBM50078395
Synonyms:
(S)-1-(2-Hydroxycarbamoyl-cyclohexanecarbonyl)-pyrrolidine-2-carboxylic acid ((S)-1-carbamoyl-ethyl)-amide | CHEMBL80368
Type:
Small organic molecule
Emp. Form.:
C16H26N4O5
Mol. Mass.:
354.4014
SMILES:
C[C@H](NC(=O)[C@@H]1CCCN1C(=O)C1CCCCC1C(=O)NO)C(N)=O
: