Target
Xaa-Pro aminopeptidase 1
Ligand
BDBM50078396
Substrate
Meas. Tech.
ChEMBL_35519 (CHEMBL644752)
IC50
53000±n/a nM
Citation
 Maggiora, LLOrawski, ATSimmons, WH Apstatin analogue inhibitors of aminopeptidase P, a bradykinin-degrading enzyme. J Med Chem 42:2394-402 (1999)  
Target
Name:
Xaa-Pro aminopeptidase 1
Synonyms:
Aminoacylproline aminopeptidase Soluble aminopeptidase P X-prolyl aminopeptidase 1, soluble XPNPEPL XPP1_HUMAN | sAmp
Type:
PROTEIN
Mol. Mass.:
69905.93
Organism:
Homo sapiens (Human)
Description:
ChEMBL_461054
Residue:
623
  
Inhibitor
Name:
BDBM50078396
Synonyms:
(S)-1-(2-Mercapto-cyclopentanecarbonyl)-pyrrolidine-2-carboxylic acid ((S)-1-carbamoyl-ethyl)-amide | CHEMBL79083
Type:
Small organic molecule
Emp. Form.:
C14H23N3O3S
Mol. Mass.:
313.416
SMILES:
C[C@H](NC(=O)[C@@H]1CCCN1C(=O)C1CCCC1S)C(N)=O
: