Target
Cytosol aminopeptidase
Ligand
BDBM50078402
Substrate
Meas. Tech.
ChEMBL_98543 (CHEMBL708591)
IC50
7800±n/a nM
Citation
 Maggiora, LLOrawski, ATSimmons, WH Apstatin analogue inhibitors of aminopeptidase P, a bradykinin-degrading enzyme. J Med Chem 42:2394-402 (1999)  
Target
Name:
Cytosol aminopeptidase
Synonyms:
AMPL_HUMAN LAP3 Leucine aminopeptidase | PEPS
Type:
PROTEIN
Mol. Mass.:
56171.75
Organism:
Homo sapiens (Human)
Description:
ChEMBL_1507539
Residue:
519
  
Inhibitor
Name:
BDBM50078402
Synonyms:
(S)-1-((R)-3-Amino-2-hydroxy-5-methyl-hexanoyl)-pyrrolidine-2-carboxylic acid ((S)-1-carbamoyl-ethyl)-amide | CHEMBL309216
Type:
Small organic molecule
Emp. Form.:
C15H28N4O4
Mol. Mass.:
328.4072
SMILES:
CC(C)CC(N)[C@@H](O)C(=O)N1CCC[C@H]1C(=O)N[C@@H](C)C(N)=O
: